{"text_format":"1","workbook":"xlsx","n_sheets":10,"sheets":["Accueil","cfonb","prélèvements","A prélever","Message","Transactions","Mandats","Mandat","Facture","Traduction"],"not_rendered":{"charts":0,"images":0,"macros":1,"external_links":0,"defined_names":54,"comments":2,"pivot_tables":0},"unopened":[],"bounds":{"document_bytes":16777216,"sheet_cells":100000,"rows_first":2000,"rows_last":500,"rows_between":2000,"halvings":0,"cell_chars":16384,"cell_head_chars":4096},"cells_cut":0,"cells_raw":0,"read":"whole","date_system":"1900"}

{"sheet":"Accueil","index":0,"n_rows":129,"n_cols":8,"rows_kept":129,"cut":false,"hidden":false,"merged":[[23,7,33,13]]}
[]
[null,{"$f":"Traduction!A2","v":"Vos informations bancaires utilisées pour le fichier banque et sur le mandat"}]
[]
[null,"Creditor Name","fournisseur",{"$f":"Traduction!$A$3","v":" (pas d'accent, uniquement les caractères autorisés)"}]
[null,"ICS","FR00ZZZ123456"]
[null,"IBAN","FR7 63006610 04100010 57380116"]
[null,"BIC","BNPAFRPPXXX"]
[]
[null,{"$f":"Traduction!$A$4","v":"Liste des mandats"},{"$f":"Traduction!A5","v":"Vous indiquez pour chaque client une RUM ainsi que les informations bancaires"},null,null,null,null,{"$f":"Traduction!A60","v":"Caractères autorisés"}]
[null,null,{"$f":"Traduction!A6","v":"RUM : référence Unique de mandat"},null,null,null,null,"a b c d e f g h i j k l m n o p q r s t u v w x y z "]
[null,null,{"$f":"Traduction!A7","v":"Pas d'espace ou de tiret dans l'IBAN"},null,null,null,null,"A B C D E F G H I J K L M N O P Q R S T U V W X Y Z "]
[null,null,{"$f":"Traduction!A8","v":"8 ou 11 caractères dans le BIC"},null,null,null,null,"0 1 2 3 4 5 6 7 8 9 "]
[null,null,{"$f":"Traduction!A9","v":"la date doit être valide"},null,null,null,null,"/ - ? : ( ) . , \" +  Espace/Space"]
[null,null,{"$f":"Traduction!A10","v":"Le nom du client doit respecter les caractères autorisés"}]
[null,{"$f":"Traduction!A12","v":"Un mandat"},{"$f":"Traduction!A13","v":"On récupère les informations d'un mandat pour en faire un document imprimable"}]
{"$rows_left_out":115}
{"sheet":"cfonb","index":1,"n_rows":2,"n_cols":20,"rows_kept":2,"cut":false,"hidden":false,"merged":[]}
["init","type opération","id débiteur","NNE","B=Référence","Débiteur","banque","xxx","guichet","Compte","D=Montant","F=Libellé","Etablissement","texte 07","IBAN","E=RUM calculée","A=Sequence Type","C=Currency",null,"Accueil"]
["06","85",null,"654321",null,"Nom debiteur",null,null,"00804","00011199988",1,"RUMRUMR2MRUMRUMRUMRUMRUMRUMRUMR","30004","endtoend2","FR7630004008040001119998882","Iban non trouvé","FRST","EUR"]

{"sheet":"prélèvements","index":2,"n_rows":70,"n_cols":16,"rows_kept":70,"cut":false,"hidden":false,"merged":[]}
[{"$f":"OFFSET(Traduction!$A$110,COLUMN()-1,0)","v":"Sequence Type"},{"$f":"OFFSET(Traduction!$A$110,COLUMN()-1,0)","v":"Id prélèvement"},{"$f":"OFFSET(Traduction!$A$110,COLUMN()-1,0)","v":"Currency"},{"$f":"OFFSET(Traduction!$A$110,COLUMN()-1,0)","v":"Montant"},{"$f":"OFFSET(Traduction!$A$110,COLUMN()-1,0)","v":"RUM"},{"$f":"OFFSET(Traduction!$A$110,COLUMN()-1,0)","v":"Infos complémentaires"},{"$f":"OFFSET(Traduction!$A$110,COLUMN()-1,0)","v":"ok"},{"$f":"OFFSET(Traduction!$A$110,COLUMN()-1,0)","v":"numéro de facture"},{"$f":"OFFSET(Traduction!$A$110,COLUMN()-1,0)","v":"référence"},{"$f":"OFFSET(Traduction!$A$110,COLUMN()-1,0)","v":"libellé"},null,null,null,null,null,{"$f":"Traduction!$A$140","v":"Accueil"}]
["RCUR","P008","EUR",123,"R001","Facture F201401-008 janvier 2014",null,{"$f":"LEFT(F2,19)","v":"Facture F201401-008"}," janvier 2015","Abonnement service xxxx"]
["RCUR","P009","EUR",96.98,"R002","Facture F201401-009 janvier 2014",null,{"$f":"LEFT(F3,19)","v":"Facture F201401-009"}," janvier 2015","Abonnement service xxxx"]
["RCUR","P010","EUR",865.3900000000001,"R003","Facture F201401-010 janvier 2014",null,"Facture F201401-010"," janvier 2015","Abonnement service xxxx"]
["RCUR","P011","EUR",{"$f":"39.15/3","v":13.049999999999999},"R004","Facture F201401-011 janvier 2014",null,"Facture F201401-011"," janvier 2015","Abonnement service xxxx"]
["RCUR","P012","EUR",11.68,"R005","Facture F201401-012 janvier 2014",null,"Facture F201401-012"," janvier 2015","Abonnement service xxxx"]
["RCUR","P013","EUR",54.365450000000003,"R006","Facture F201401-013 janvier 2014",null,"Facture F201401-013"," janvier 2015","Abonnement service xxxx"]
["RCUR","P014","EUR",165.18,"R007","Facture F201401-014 janvier 2014",null,"Facture F201401-014"," janvier 2015","Abonnement service xxxx"]
["RCUR","P015","EUR",456,"R008","Facture F201401-015 janvier 2014",null,"Facture F201401-015"," janvier 2015","Abonnement service xxxx"]
["RCUR","P016","EUR",210.9787,"R009","Facture F201401-016 janvier 2014",null,"Facture F201401-016"," janvier 2015","Abonnement service xxxx"]
["RCUR","P017","EUR",769.32365000000004,"R010","Facture F201401-017 janvier 2014",null,"Facture F201401-017"," janvier 2015","Abonnement service xxxx"]
["RCUR","P018","EUR",462.22356000000002,"R011","Facture F201401-018 janvier 2014",null,"Facture F201401-018"," janvier 2015","Abonnement service xxxx"]
["RCUR","P019","EUR",792.61,"R012","Facture F201401-019 janvier 2014",null,"Facture F201401-019"," janvier 2015","Abonnement service xxxx"]
["RCUR","P020","EUR",61.410000000000004,"R013","Facture F201401-020 janvier 2014",null,"Facture F201401-020"," janvier 2015","Abonnement service xxxx"]
["RCUR","P021","EUR",49.86,"R014","Facture F201401-021 janvier 2014",null,"Facture F201401-021"," janvier 2015","Abonnement service xxxx"]
{"$rows_left_out":56}
{"sheet":"A prélever","index":3,"n_rows":70,"n_cols":24,"rows_kept":70,"cut":false,"hidden":true,"merged":[]}
[{"$f":"OFFSET(Traduction!$A$110,COLUMN()-1,0)","v":"Sequence Type"},{"$f":"OFFSET(Traduction!$A$110,COLUMN()-1,0)","v":"Id prélèvement"},{"$f":"OFFSET(Traduction!$A$110,COLUMN()-1,0)","v":"Currency"},{"$f":"OFFSET(Traduction!$A$110,COLUMN()-1,0)","v":"Montant"},{"$f":"OFFSET(Traduction!$A$110,COLUMN()-1,0)","v":"RUM"},{"$f":"OFFSET(Traduction!$A$110,COLUMN()-1,0)","v":"Infos complémentaires"},"ligne","Date accord prélèvement","IBAN","BIC","Client",null,{"$f":"$A$1","v":"Sequence Type"},{"$f":"$A$1","v":"Sequence Type"},null,{"$f":"B1","v":"Id prélèvement"},{"$f":"C1","v":"Currency"},{"$f":"D1","v":"Montant"},{"$f":"E1","v":"RUM"},{"$f":"H1","v":"Date accord prélèvement"},{"$f":"J1","v":"BIC"},{"$f":"K1","v":"Client"},{"$f":"I1","v":"IBAN"},{"$f":"F1","v":"Infos complémentaires"}]
["RCUR","P008","EUR",123,"R001","Facture F201401-008 janvier 2014",{"$f":"MATCH(E2,Mandats!A:A,0)","v":2},"2014-01-01","AL90208110080000001039531801","PSSTFRPPPAR","Rekall",null,"RCUR",{"$f":"Message!C8","v":"RCUR"},null,"P008","EUR",123,"R001","2014-01-01","PSSTFRPPPAR","Rekall","AL90208110080000001039531801","Facture F201401-008 janvier 2014"]
["RCUR","P009","EUR",96.98,"R002","Facture F201401-009 janvier 2014",{"$f":"MATCH(E3,Mandats!A:A,0)","v":3},"2014-01-01","AT131490022010010999","PSSTFRPPPAR","Le Developpement Industriel",null,"FRST",{"$f":"DCOUNTA(A:K,A1,krit1)","v":47},null,"P009","EUR",96.98,"R002","2014-01-01","PSSTFRPPPAR","Le Developpement Industriel","AT131490022010010999","Facture F201401-009 janvier 2014"]
["RCUR","P010","EUR",865.3900000000001,"R003","Facture F201401-010 janvier 2014",{"$f":"MATCH(E4,Mandats!A:A,0)","v":4},"2014-01-01","BE68844010370034","PSSTFRPPPAR","COGIP",null,"OOFF",null,null,"P010","EUR",865.3900000000001,"R003","2014-01-01","PSSTFRPPPAR","COGIP","BE68844010370034","Facture F201401-010 janvier 2014"]
["RCUR","P011","EUR",{"$f":"39.15/3","v":13.049999999999999},"R004","Facture F201401-011 janvier 2014",{"$f":"MATCH(E5,Mandats!A:A,0)","v":5},"2014-01-01","CZ4201000000195505030267","PSSTFRPPPAR","France Hebdo",null,null,null,null,"P011","EUR",13.049999999999999,"R004","2014-01-01","PSSTFRPPPAR","France Hebdo","CZ4201000000195505030267","Facture F201401-011 janvier 2014"]
["RCUR","P012","EUR",11.68,"R005","Facture F201401-012 janvier 2014",{"$f":"MATCH(E6,Mandats!A:A,0)","v":6},"2014-01-01","EE342200221034126658","PSSTFRPPPAR","Factory Mode",null,null,null,null,"P012","EUR",11.68,"R005","2014-01-01","PSSTFRPPPAR","Factory Mode","EE342200221034126658","Facture F201401-012 janvier 2014"]
["RCUR","P013","EUR",54.365450000000003,"R006","Facture F201401-013 janvier 2014",{"$f":"MATCH(E7,Mandats!A:A,0)","v":7},"2014-01-01","FI9814283500171141","PSSTFRPPPAR","Canapi",null,null,null,null,"P013","EUR",54.365450000000003,"R006","2014-01-01","PSSTFRPPPAR","Canapi","FI9814283500171141","Facture F201401-013 janvier 2014"]
["RCUR","P014","EUR",165.18,"R007","Facture F201401-014 janvier 2014",{"$f":"MATCH(E8,Mandats!A:A,0)","v":8},"2014-01-02","FR7630066100410001057380116","PSSTFRPPPAR","Santhe/Sienar Technologies",null,null,null,null,"P014","EUR",165.18,"R007","2014-01-02","PSSTFRPPPAR","Santhe/Sienar Technologies","FR7630066100410001057380116","Facture F201401-014 janvier 2014"]
["RCUR","P015","EUR",456,"R008","Facture F201401-015 janvier 2014",{"$f":"MATCH(E9,Mandats!A:A,0)","v":9},"2014-01-03","DE12500105170648489890","PSSTFRPPPAR","Rosserys  et  Wichcraft",null,null,null,null,"P015","EUR",456,"R008","2014-01-03","PSSTFRPPPAR","Rosserys  et  Wichcraft","DE12500105170648489890","Facture F201401-015 janvier 2014"]
["RCUR","P016","EUR",210.9787,"R009","Facture F201401-016 janvier 2014",{"$f":"MATCH(E10,Mandats!A:A,0)","v":10},"2014-01-04","HU29117080012054779400000000","PSSTFRPPPAR","Madone",null,null,null,null,"P016","EUR",210.9787,"R009","2014-01-04","PSSTFRPPPAR","Madone","HU29117080012054779400000000","Facture F201401-016 janvier 2014"]
["RCUR","P017","EUR",769.32365000000004,"R010","Facture F201401-017 janvier 2014",{"$f":"MATCH(E11,Mandats!A:A,0)","v":11},"2014-01-05","IE92BOFI90001710027952","PSSTFRPPPAR","Kiff",null,null,null,null,"P017","EUR",769.32365000000004,"R010","2014-01-05","PSSTFRPPPAR","Kiff","IE92BOFI90001710027952","Facture F201401-017 janvier 2014"]
["RCUR","P018","EUR",462.22356000000002,"R011","Facture F201401-018 janvier 2014",{"$f":"MATCH(E12,Mandats!A:A,0)","v":12},"2014-01-06","IT68D0300203280000400162854","PSSTFRPPPAR","Aaltra",null,null,null,null,"P018","EUR",462.22356000000002,"R011","2014-01-06","PSSTFRPPPAR","Aaltra","IT68D0300203280000400162854","Facture F201401-018 janvier 2014"]
["RCUR","P019","EUR",792.61,"R012","Facture F201401-019 janvier 2014",{"$f":"MATCH(E13,Mandats!A:A,0)","v":13},"2014-01-07","LI1008800000020176306","PSSTFRPPPAR","Geugene Industrie",null,null,null,null,"P019","EUR",792.61,"R012","2014-01-07","PSSTFRPPPAR","Geugene Industrie","LI1008800000020176306","Facture F201401-019 janvier 2014"]
["RCUR","P020","EUR",61.410000000000004,"R013","Facture F201401-020 janvier 2014",{"$f":"MATCH(E14,Mandats!A:A,0)","v":14},"2014-01-08","LU761111000872960000","PSSTFRPPPAR","6000 SUX",null,null,null,null,"P020","EUR",61.410000000000004,"R013","2014-01-08","PSSTFRPPPAR","6000 SUX","LU761111000872960000","Facture F201401-020 janvier 2014"]
["RCUR","P021","EUR",49.86,"R014","Facture F201401-021 janvier 2014",{"$f":"MATCH(E15,Mandats!A:A,0)","v":15},"2014-01-09","MT98MMEB44093000000009027293051","PSSTFRPPPAR","O.C.P.",null,null,null,null,"P021","EUR",49.86,"R014","2014-01-09","PSSTFRPPPAR","O.C.P.","MT98MMEB44093000000009027293051","Facture F201401-021 janvier 2014"]
{"$rows_left_out":56}
{"sheet":"Message","index":4,"n_rows":42,"n_cols":9,"rows_kept":42,"cut":false,"hidden":true,"merged":[]}
[]
[null,"Navigation"]
[null,null,"Accueil",null,null,null,"Activation licence"]
[null,null,"Transactions"]
[]
[null,{"$f":"Traduction!$A$139","v":"Titre"}]
[null,{"$f":"Traduction!$A$139","v":"Titre"},"Factures decembre"]
[null,"+ Sequence Type","RCUR",null,"Xpath = /Document/CstmrDrctDbtInitn/GrpHdr +"]
[null,{"$f":"Traduction!$A$138","v":"Date prélèvement"},"2024-01-24"]
[]
[null,"Message Group header"]
[null,"Message Identification:",{"$f":"C7&\" \"&sequence_type","v":"Factures decembre RCUR"},null,"/MsgId"]
[null,"Creation Date Time:",{"$f":"NOW()","v":"2024-01-24T10:50:47.750"},null,"/CreDtTm"]
[null,"Number Of Transactions:",{"$f":"COUNTA(tbTransactions[End To End Id])","v":47},null,"/NbOfTxs",null,"RCUR",{"$f":"SUMIF(prélèvements!A:A,G14,prélèvements!D:D)","v":20019.724020000001},{"$f":"COUNTIF(prélèvements!A:A,G14)","v":47}]
[null,"Control Sum:",{"$f":"SUM(tbTransactions[Instructed Amount])","v":20019.724020000001},null,"/CtrlSum",null,"FRST",{"$f":"SUMIF(prélèvements!A:A,G15,prélèvements!D:D)","v":1011.88},{"$f":"COUNTIF(prélèvements!A:A,G15)","v":13}]
{"$rows_left_out":28}
{"sheet":"Transactions","index":5,"n_rows":53,"n_cols":20,"rows_kept":53,"cut":false,"hidden":true,"merged":[]}
[null,null,null,null,{"$f":"Traduction!$A$132","v":"Feuille message"},null,null,null,null,{"$f":"Traduction!$A$133","v":"Informations supplémentaires : ajoutez les infos dans les feuilles mandats ou prélèvements puis mappez le fichier xml"}]
["Payment Direct Debit Transactions",null,null,null,null,null,{"$f":"Message!B14","v":"Number Of Transactions:"},{"$f":"Message!C14","v":47},null,{"$f":"Traduction!$A$134","v":"Aide en ligne"}]
[null,null,null,null,null,null,{"$f":"Message!B15","v":"Control Sum:"},{"$f":"Message!C15","v":20019.724020000001},null,"Mandats","Mandats","Mandats","Mandats","Mandats","Mandats","prélèvements","prélèvements","Pas de champ","Pas de champ","Pas de champ"]
["XPath = /Document/CstmrDrctDbtInitn/PmtInf +",null,null,null,null,null,null,null,"/DrctDbtTxInf/RmtInf/Ustrd","Société","Nom","prénom","adresse1","adresse2","cpville","numéro de facture","libellé"]
["/DrctDbtTxInf/PmtId/EndToEndId","/DrctDbtTxInf/InstdAmt/@Ccy","/DrctDbtTxInf/InstdAmt","/DrctDbtTxInf/DrctDbtTx/MndtRltdInf/MndtId","/DrctDbtTxInf/DrctDbtTx/MndtRltdInf/DtOfSgntr","/DrctDbtTxInf/DbtrAgt/FinInstnId/BIC","/DrctDbtTxInf/Dbtr/Nm","/DrctDbtTxInf/DbtrAcct/Id/IBAN",{"$f":"Traduction!$A$124","v":"Enlever les accents"},"Non","Non","Non","Non","Non","Non","Non","Non","Non","Non","Non"]
["End To End Id","Currency","Instructed Amount","Mandate Id","Date Of Signature","Financial Institution Id","Debtor Name","Debtor Account ID","Remittance Information","0","1","2","3","4","5","6","7","8","9","10"]
["P008","EUR",123,"R001","2014-01-01","PSSTFRPPPAR","Rekall","AL90208110080000001039531801","Facture F201401-008 janvier 2014","Rekall",null,null,null,null,null,"Facture F201401-008","Abonnement service xxxx"]
["P009","EUR",96.98,"R002","2014-01-01","PSSTFRPPPAR","Le Developpement Industriel","AT131490022010010999","Facture F201401-009 janvier 2014","Le Developpement Industriel",null,null,null,null,null,"Facture F201401-009","Abonnement service xxxx"]
["P010","EUR",865.3900000000001,"R003","2014-01-01","PSSTFRPPPAR","COGIP","BE68844010370034","Facture F201401-010 janvier 2014","COGIP",null,null,null,null,null,"Facture F201401-010","Abonnement service xxxx"]
["P011","EUR",13.049999999999999,"R004","2014-01-01","PSSTFRPPPAR","France Hebdo","CZ4201000000195505030267","Facture F201401-011 janvier 2014","France Hebdo",null,null,null,null,null,"Facture F201401-011","Abonnement service xxxx"]
["P012","EUR",11.68,"R005","2014-01-01","PSSTFRPPPAR","Factory Mode","EE342200221034126658","Facture F201401-012 janvier 2014","Factory Mode",null,null,null,null,null,"Facture F201401-012","Abonnement service xxxx"]
["P013","EUR",54.365450000000003,"R006","2014-01-01","PSSTFRPPPAR","Canapi","FI9814283500171141","Facture F201401-013 janvier 2014","Canapi",null,null,null,null,null,"Facture F201401-013","Abonnement service xxxx"]
["P014","EUR",165.18,"R007","2014-01-02","PSSTFRPPPAR","Santhe/Sienar Technologies","FR7630066100410001057380116","Facture F201401-014 janvier 2014","Santhe/Sienar Technologies",null,null,null,null,null,"Facture F201401-014","Abonnement service xxxx"]
["P015","EUR",456,"R008","2014-01-03","PSSTFRPPPAR","Rosserys  et  Wichcraft","DE12500105170648489890","Facture F201401-015 janvier 2014","Rosserys  et  Wichcraft",null,null,null,null,null,"Facture F201401-015","Abonnement service xxxx"]
["P016","EUR",210.9787,"R009","2014-01-04","PSSTFRPPPAR","Madone","HU29117080012054779400000000","Facture F201401-016 janvier 2014","Madone",null,null,null,null,null,"Facture F201401-016","Abonnement service xxxx"]
{"$rows_left_out":39}
{"sheet":"Mandats","index":6,"n_rows":24,"n_cols":15,"rows_kept":24,"cut":false,"hidden":false,"merged":[]}
[{"$f":"Traduction!A65","v":"RUM"},{"$f":"OFFSET(Traduction!$A$65,COLUMN()-1,0)","v":"Date accord prélèvement"},{"$f":"OFFSET(Traduction!B65,COLUMN()-1,0)","v":"IBAN"},{"$f":"OFFSET(Traduction!$A$65,COLUMN()-1,0)","v":"BIC"},{"$f":"OFFSET(Traduction!$A$65,COLUMN()-1,0)","v":"Client"},{"$f":"OFFSET(Traduction!$A$65,COLUMN()-1,0)","v":"ok"},{"$f":"OFFSET(Traduction!$A$65,COLUMN()-1,0)","v":"Type paiement"},{"$f":"OFFSET(Traduction!$A$65,COLUMN()-1,0)","v":"Société"},{"$f":"OFFSET(Traduction!$A$65,COLUMN()-1,0)","v":"Nom"},{"$f":"OFFSET(Traduction!$A$65,COLUMN()-1,0)","v":"prénom"},{"$f":"OFFSET(Traduction!$A$65,COLUMN()-1,0)","v":"adresse1"},{"$f":"OFFSET(Traduction!$A$65,COLUMN()-1,0)","v":"adresse2"},{"$f":"OFFSET(Traduction!$A$65,COLUMN()-1,0)","v":"cpville"},{"$f":"OFFSET(Traduction!$A$65,COLUMN()-1,0)","v":"autre"},{"$f":"Traduction!A80","v":"Accueil"}]
["R001","2014-01-01","AL90208110080000001039531801","PSSTFRPPPAR","Rekall",null,"Récurrent","Rekall"]
["R002","2014-01-01","AT131490022010010999","PSSTFRPPPAR","Le Developpement Industriel",null,"Récurrent","Le Developpement Industriel"]
["R003","2014-01-01","BE68844010370034","PSSTFRPPPAR","COGIP",null,"Ponctuel","COGIP"]
["R004","2014-01-01","CZ4201000000195505030267","PSSTFRPPPAR","France Hebdo",null,"Récurrent","France Hebdo"]
["R005","2014-01-01","EE342200221034126658","PSSTFRPPPAR","Factory Mode",null,"Ponctuel","Factory Mode"]
["R006","2014-01-01","FI9814283500171141","PSSTFRPPPAR","Canapi",null,"Récurrent","Canapi"]
["R007","2014-01-02","FR7630066100410001057380116","PSSTFRPPPAR","Santhe/Sienar Technologies",null,"Récurrent","Santhe/Sienar Technologies"]
["R008","2014-01-03","DE12500105170648489890","PSSTFRPPPAR","Rosserys  et  Wichcraft",null,"Récurrent","Rosserys  et  Wichcraft"]
["R009","2014-01-04","HU29117080012054779400000000","PSSTFRPPPAR","Madone",null,"Récurrent","Madone"]
["R010","2014-01-05","IE92BOFI90001710027952","PSSTFRPPPAR","Kiff",null,"Récurrent","Kiff"]
["R011","2014-01-06","IT68D0300203280000400162854","PSSTFRPPPAR","Aaltra",null,"Récurrent","Aaltra"]
["R012","2014-01-07","LI1008800000020176306","PSSTFRPPPAR","Geugene Industrie",null,"Récurrent","Geugene Industrie"]
["R013","2014-01-08","LU761111000872960000","PSSTFRPPPAR","6000 SUX",null,"Récurrent","6000 SUX"]
["R014","2014-01-09","MT98MMEB44093000000009027293051","PSSTFRPPPAR","O.C.P.",null,"Récurrent","O.C.P."]
{"$rows_left_out":10}
{"sheet":"Mandat","index":7,"n_rows":44,"n_cols":6,"rows_kept":44,"cut":false,"hidden":false,"merged":[[7,4,9,5],[35,4,37,5]]}
[null,{"$f":"Traduction!A90","v":"Mandat de prélèvement SEPA"},null,null,null,{"$f":"Traduction!$A$81","v":"Mandats"}]
[null,null,null,null,null,{"$f":"Traduction!$A$82","v":"ligne feuille mandats"}]
[null,{"$f":"Traduction!A89","v":"Référence unique de mandat (RUM)"},null,null,null,2]
[null,{"$f":"INDEX(Mandats!A:A,ligne)","v":"R001"},null,null,null,{"$f":"Traduction!$A$83","v":"Indiquez ici votre nom pour le texte"}]
[null,null,null,null,null,"XXXXXXXXX"]
[null,{"$f":"Traduction!A88&F5&\" à envoyer des instructions à votre banque pour débiter votre compte.\"","v":"En signant ce formulaire de mandat, vous autorisez XXXXXXXXX à envoyer des instructions à votre banque pour débiter votre compte."},null,null,null,{"$f":"Traduction!A85","v":"Nom pdf par défaut"}]
[null,{"$f":"Traduction!A87&F5","v":"Et vous autorisez votre banque à débiter votre compte conformément aux instructions de XXXXXXXXX"},null,null,null,{"$f":"\"Mandat \" &B4 & \" \"&INDEX(Mandats!E:E,ligne)","v":"Mandat R001 Rekall"}]
[null,{"$f":"Traduction!A86","v":"Vous bénéficiez du droit d'être remboursé par votre banque suivant les conditions décrites dans la convention que vous avez passée avec elle. Une demande de remboursement doit être présentée dans les 8 semaines suivant la date de débit de votre compte pour un prélèvement autorisé."},null,null,{"$f":"Traduction!$A$99","v":"Les informations concernant le débiteur doivent être mises dans la liste des mandats."}]
[]
[null,{"$f":"Traduction!$A$91","v":"Débiteur"}]
[]
[null,{"$f":"INDEX(Mandats!H:H,ligne)","v":"Rekall"}]
[null,{"$f":"INDEX(Mandats!I:I,ligne)","v":0},null,null,{"$f":"Traduction!A101","v":"Formules pour l'affichage d'espaces dans l'iban"}]
[null,{"$f":"INDEX(Mandats!J:J,ligne)","v":0},null,{"$f":"IF(INDEX(Mandats!C:C,ligne)=0,\"\",INDEX(Mandats!C:C,ligne))","v":"AL90208110080000001039531801"}]
[null,{"$f":"INDEX(Mandats!K:K,ligne)","v":0},null,1,{"$f":"MID($D$14,1+(D15-1)*4,4)","v":"AL90"}]
{"$rows_left_out":30}
{"sheet":"Facture","index":8,"n_rows":35,"n_cols":11,"rows_kept":35,"cut":false,"hidden":true,"merged":[]}
[null,null,null,null,null,null,null,{"$f":"Traduction!$A$131","v":"Ligne"}]
[null,null,null,null,null,null,null,7,null,{"$f":"Traduction!$A$122","v":"fichier pdf par défaut"},{"$f":"SUBSTITUTE(SUBSTITUTE(SUBSTITUTE(K5&\"-\"&K4&\"-\"&K11,\"/\",\"-\"),\":\",\"-\"),\"\\\",\"-\")","v":"P008-Factures decembre RCUR-Rekall"}]
[]
[null,null,null,null,null,null,null,null,null,"message id",{"$f":"message_id","v":"Factures decembre RCUR"}]
[null,null,null,null,null,null,null,null,null,{"$f":"INDEX(Transactions!$6:$6,ROW()-4)","v":"End To End Id"},{"$f":"INDEX(Transactions!A:A,ligne_facture)","v":"P008"}]
[null,null,null,null,null,null,null,null,null,{"$f":"INDEX(Transactions!$6:$6,ROW()-4)","v":"Currency"},{"$f":"INDEX(Transactions!B:B,ligne_facture)","v":"EUR"}]
["XXXXX",null,null,null,null,null,null,null,null,{"$f":"INDEX(Transactions!$6:$6,ROW()-4)","v":"Instructed Amount"},{"$f":"INDEX(Transactions!C:C,ligne_facture)","v":123}]
["3 rue du général de Gaulle",null,null,null,null,null,null,null,null,{"$f":"INDEX(Transactions!$6:$6,ROW()-4)","v":"Mandate Id"},{"$f":"INDEX(Transactions!D:D,ligne_facture)","v":"R001"}]
["94000 Créteil",null,null,null,null,null,null,null,null,{"$f":"INDEX(Transactions!$6:$6,ROW()-4)","v":"Date Of Signature"},{"$f":"INDEX(Transactions!E:E,ligne_facture)","v":41640}]
[null,null,null,null,null,null,null,null,null,{"$f":"INDEX(Transactions!$6:$6,ROW()-4)","v":"Financial Institution Id"},{"$f":"INDEX(Transactions!F:F,ligne_facture)","v":"PSSTFRPPPAR"}]
[{"$f":"TODAY()","v":"2024-01-24"},null,null,null,null,null,null,null,null,{"$f":"INDEX(Transactions!$6:$6,ROW()-4)","v":"Debtor Name"},{"$f":"INDEX(Transactions!G:G,ligne_facture)","v":"Rekall"}]
[null,null,null,{"$f":"K14","v":"Rekall"},null,null,null,null,null,{"$f":"INDEX(Transactions!$6:$6,ROW()-4)","v":"Debtor Account ID"},{"$f":"INDEX(Transactions!H:H,ligne_facture)","v":"AL90208110080000001039531801"}]
[null,null,null,{"$f":"IF(K16=0,\"\",K16&\" \")&IF(K15=0,\"\",K15)","v":""},null,null,null,null,null,{"$f":"INDEX(Transactions!$6:$6,ROW()-4)","v":"Remittance Information"},{"$f":"INDEX(Transactions!I:I,ligne_facture)","v":"Facture F201401-008 janvier 2014"}]
[null,null,null,{"$f":"K17","v":0},null,null,null,null,null,{"$f":"INDEX(Transactions!$6:$6,ROW()-4)","v":"0"},{"$f":"INDEX(Transactions!J:J,ligne_facture)","v":"Rekall"}]
[null,null,null,{"$f":"K18","v":0},null,null,null,null,null,{"$f":"INDEX(Transactions!$6:$6,ROW()-4)","v":"1"},{"$f":"INDEX(Transactions!K:K,ligne_facture)","v":0}]
{"$rows_left_out":21}
{"sheet":"Traduction","index":9,"n_rows":176,"n_cols":3,"rows_kept":176,"cut":false,"hidden":false,"merged":[]}
[1,"FR","EN"]
[{"$f":"INDEX(B2:C2,$A$1)","v":"Vos informations bancaires utilisées pour le fichier banque et sur le mandat"},"Vos informations bancaires utilisées pour le fichier banque et sur le mandat","Your banking details used for bank file and mandate"]
[{"$f":"INDEX(B3:C3,$A$1)","v":" (pas d'accent, uniquement les caractères autorisés)"}," (pas d'accent, uniquement les caractères autorisés)"," (No accent, only the allowable characters)"]
["Liste des mandats","Liste des mandats","List of mandates"]
["Vous indiquez pour chaque client une RUM ainsi que les informations bancaires","Vous indiquez pour chaque client une RUM ainsi que les informations bancaires","For each customer, specify the UMR and bank details"]
["RUM : référence Unique de mandat","RUM : référence Unique de mandat","UMR: Unique mandate reference"]
["Pas d'espace ou de tiret dans l'IBAN","Pas d'espace ou de tiret dans l'IBAN","No spaces or dashes in the IBAN"]
["8 ou 11 caractères dans le BIC","8 ou 11 caractères dans le BIC","8 or 11 characters in the BIC"]
["la date doit être valide","la date doit être valide","the date must be valid"]
["Le nom du client doit respecter les caractères autorisés","Le nom du client doit respecter les caractères autorisés","The customer name must meet the allowable characters"]
["Voir les mandats et paiements","Voir les mandats et paiements","See the mandates and payments"]
["Un mandat","Un mandat","A mandate"]
["On récupère les informations d'un mandat pour en faire un document imprimable","On récupère les informations d'un mandat pour en faire un document imprimable","Mandate details are retrieved to convert it into a printable document"]
["ce document une fois personnalisé permettra d'être présenté au ","ce document une fois personnalisé permettra d'être présenté au ","Once this document is customized, it will be submitted to "]
["client pour sa signature","client pour sa signature","customer for signature"]
{"$rows_left_out":161}